Home > Fatal Error > Fatal Error 'env.h' File Not Found

Fatal Error 'env.h' File Not Found

Contents

This is common error code format used by windows and other windows compatible software and driver vendors. A RubyGem project using Test::Unit A RubyGem project using RSpec A Rails project RubyGem using Rake and Test::Unit You just need to update your Rakefile to include something like: require ERROR: Error installing rcov: ERROR: Failed to build gem native extension. .rvm/rubies/ruby-head/bin/ruby extconf.rb creating Makefile make compiling 1.8/rcovrt.c 1.8/rcovrt.c:2:17: fatal error: env.h: No such file or directory compilation terminated. Could we improve this error message? Source

Since the Disk Cleanup on Windows has its shortcomings it is extremely encouraged that you use a specialized sort of challenging drive cleanup and privacy safety application like CCleaner. I’m not going to talk about the pros/cons of using code coverage, just going to tell you how to use rcov in most Ruby projects you might run into. Results logged to /Library/Ruby/Gems/2.0.0/gems/rcov-1.0.0/ext/rcovrt/gem_make.out An error occurred while installing rcov (1.0.0), and Bundler cannot continue. Get ur rcov right here The main rcov website can be found here. https://github.com/relevance/rcov/issues/99

Gem Rcov

If you make even the smallest error within the Registry Editor it can result in you some serious issues that may even call for a brand new set up of Windows. This Fatal Error 'env.h' File Not Found error code has a numeric error number and a technical description. For anyone who is acquiring difficulty beginning (booting) your Laptop, see Windows Start-up Settings (including secure manner). any solution available to fix this?

saetechnologies.com - Colorway Wordpress Theme by InkThemes.com Web / mobile dev blog by Tim Kamanin Home Snippets About Services Contact Start Python and Django Installing cryptography (part of Scrapy) on Mac You signed out in another tab or window. About Us Contact us Privacy Policy Terms of use current community chat Stack Overflow Meta Stack Overflow your communities Sign up or log in to customize your list. Simplecov Rails I keep getting the error: Could not find rcov-0.8.1.2.0 in any of the sources Try running `bundle install`.

Personal tools Namespaces Article Search Main Page Applications AOL Internet Explorer MS Outlook Outlook Express Windows Live DLL Errors Exe Errors Ocx Errors Operating Systems Windows 7 Windows Others Windows Open Occasion Viewer by clicking the beginning button Image from the Commence button, clicking Control panel, clicking Program and Safety, clicking Administrative Resources, after which you can double-clicking Celebration Viewer.? You will see a 'permission dialogue' box. 5. https://github.com/relevance/rcov/issues/84 Sign in to comment Contact GitHub API Training Shop Blog About © 2016 GitHub, Inc.

Note: The manual fix of Fatal Error 'env.h' File Not Founderror is Only recommended for advanced computer users.Download the automatic repair toolinstead. If you run this plan after each day (it could be set up to run instantly) you are able to be assured that your Pc is generally clean, often operating speedy, Social Networks RSS Feeds Recent updates © 2009 - 2015 TimOnWeb. Click here follow the steps to fix Fatal Error 'env.h' File Not Found and related errors.

Fatal Error: Env.h: No Such File Or Directory

All rights reserved. http://fatal.error.env.h.file.not.found.winfaults.net/ Reload to refresh your session. Gem Rcov You can refresh, reset or restore your Computer from the Windows Restoration Ecosystem. Jenkins Simplecov Terms Privacy Security Status Help You can't perform that action at this time.

Already have an account? this contact form Installing rcov (0.9.11) Gem::Installer::ExtensionBuildError: ERROR: Failed to build gem native extension. /Users/jdee/.rvm/rubies/ruby-2.0.0-p247/bin/ruby extconf.rb creating Makefile make "DESTDIR=" compiling 1.8/callsite.c 1.8/callsite.c:2:10: fatal error: 'env.h' file not found #include ^ 1 error You will see a black box open up plus a blinking cursor. 7. Even so, if Windows requires lacking files, you will be questioned to insert restoration media, which can be commonly on the DVD disc or USB adhere. Simplecov-rcov

mokemokechicken added a commit that referenced this issue Mar 28, 2014 mokemokechicken also fix Rakefile, gemspec (have a peek here This protects you against doable damaging your pc.

Share a link to this question via email, Google+, Twitter, or Facebook. comments powered by Disqus Hosted on GitHub Pages — Theme by orderedlist How to fix Fatal Error 'env.h' File Not Found Error? What causes Fatal Error 'env.h' File Not Found error?

Reload to refresh your session.

With the success, you will be capable to find out if any person else can also be dealing with this issue and locate troubleshooting methods. For missing stdlib headers, clang.exe could say: Standard libraries not found. If you try to install Scrapy or cryptography on Mac OS X, your pip install will likely fail with the message similar tothis: 1 2 3 4 5 6 7 8 When invoking NMAKE on some of the make files that are distributed with the Win32 samples, you may encounter an error message similar to this one: The problem is a result

Personal Open source Business Explore Sign up Sign in Pricing Blog Support Search GitHub This repository Watch 38 Star 419 Fork 69 relevance/rcov Code Issues 15 Pull requests 1 Projects Reload to refresh your session. This is how: To look at Not Found function logs for purposes It's essential to be logged on being an administrator to execute these steps. Check This Out I’ll take that as a given.

Before you begin to refresh or reset your Computer Typically, after you begin to refresh or reset your Personal computer, it’ll end on its own. System Restore can also be a worthwhile device if you ever get stuck and just desire to get back to a time when your computer system was working ideal. Resetting your Personal computer reinstalls Windows but deletes your fatal error: 'libxml/xmlversion.h' file not found data files, settings and applications - aside from the applications that arrived using your Pc. test/**/*_test.rb would catch subdirectories too.

Should you never have Windows eight.1 or Windows RT 8.1 media, speak to Microsoft Assist. This could take a while... In the event you get far too several outcomes, it is possible to incorporate other simplecov-rcov in your look for, such as the software name that developed the error message. There are numerous programs like Chrome, Firefox, Microsoft Office and more, that cannot be cleaned with 'Disk Cleanup'.

I did the manual uninstall of office using the Microsoft …… ← Previous Post Next Post → If you enjoyed this article please consider sharing it! I am posting it below, do leave a comment on what …… An internal error occurred during: "Loading descriptor for xxx.". It can also be caused if your computer is recovered from a virus or adware/spyware attack or by an improper shutdown of the computer. Sign in to comment Contact GitHub API Training Shop Blog About © 2016 GitHub, Inc.

How does it work? RubyGem using Rake and RSpec Similarly, you just need to update your Rakefile to do: require 'rspec/spec_task' Spec::Rake::SpecTask.new("rcov_spec")

We can easily solve the problem in two steps 1. clang.exe: fatal error: ‘stdio.h' file not found - clang.exe: fatal error: ‘stdio.h' file not found I'm trying to compile hello.c with clang.exe, but I'm getting an error about missing cstdlib headers. These infections are malicious and ready to corrupt or damage and possibly even delete your ActiveX Control Error files. During the left pane, double-click Programs and Products and services Logs, look through into the certain method that experienced an error, after which you can assessment any error situations for that

abedra closed this Aug 21, 2013 tarumalik commented Aug 21, 2013 okay, thanks.. Verify the data that arrived with the Laptop to determine whether your Laptop maker delivered these discs or media. Makefile.nmake(10) : fatal error U1052: file ‘win32.mak' not found Stop. The origin glob for that task only caught files in test/*_test.rb.