Home > Fatal Error > Fatal Error Isl/version.h

Fatal Error Isl/version.h

Note that registered members see fewer ads, and ContentLink is completely disabled once you log in. Stefan On Mon, Jun 30, 2014 at 12:55 PM, Jose Teixeira de Sousa <[hidden email]> wrote: > Here it is, thanks. > > Jose > > > > > On Fri, The build runs for quite awhile and aborts on the following checking whether ln -s works... I installed it and the problem was solved. Source

This is free software; see the source for copying conditions. If that doesn't help, could you attach the full config.log? Alves Redol 9 > 1000-029 Lisboa > Portugal _______________________________________________ OpenRISC mailing list [hidden email] http://lists.openrisc.net/listinfo/openrisc Stefan Kristiansson Reply | Threaded Open this post in threaded view ♦ ♦ | Report Probably the comment was deleted by the author, so I removed it from my answer. –Amumu Nov 16 '13 at 8:18 | show 5 more comments Your Answer draft saved https://gcc.gnu.org/ml/gcc-help/2014-08/msg00078.html

The errors in the config.log are still the same: Code: configure:5910: gcc -o conftest -g -O2 -I$$r/$(HOST_SUBDIR)/gmp -I$$s/gmp -I$$r /$(HOST_SUBDIR)/mpfr/src -I$$s/mpfr/src -I$$s/mpc/src conftest.c -lisl >&5 conftest.c:10:25: fatal error: isl/version.h: No such make[2]: *** [configure-stage1-target-libgcc] Error 1 make[2]: Leaving directory `/home/hoangtu/Downloads/gcc-4.8.1' make[1]: *** [stage1-bubble] Error 2 make[1]: Leaving directory `/home/hoangtu/Downloads/gcc-4.8.1' make: *** [all] Error 2 Is Ubuntu 13.04 too new for gcc to de Sousa, PhD >> > Office: +351 213 100 213 >> > R. configure:4785: $? = 1 configure:4774: /usr/local/bin/c++ -qversion >&5 c++: error: unrecognized command line option '-qversion' c++: fatal error: no input files compilation terminated.

It appears you didn't copy/paste the commands right as the --target part wasn't applied. This is the steps that I followed: http://wiki.mintsoc.or/doku.php?id=gnu_toolchain_for_bare_metal This is the error log.Log:Thread model: posixgcc version 4.8.2 (Ubuntu 4.8.2-19ubuntu1) configure:4816: $? = 0configure:4805: g++ -V >&5g++: error: unrecognized command line option configure: error: in `/home/jgd/gcc/gcc-4.8.0/gcc-4.8.0-arm/arm-angstrom-linux-gnueabi/libgcc': configure: error: cannot compute suffix of object files: cannot compile See `config.log' for more details. Franck, do you have any idea about why the or1ksim link would fail? ​I have no idea.​ ​Franck.​ -- Jose T.

no configure: error: in `/home/lfs/lfs/sources/gcc-build/gmp': configure: error: C compiler cannot create executables See `config.log' for more details Makefile:4810: recipe for target 'configure-stage2-gmp' failed make[2]: *** [configure-stage2-gmp] Error 77 make[2]: Leaving directory What versions of makepkg and gcc are you using? Follow Jonathan's instructions. Browse other questions tagged chromium gcc or ask your own question.

Does notation ever become "easier"? How do I fix this ? Because WPA 2 is compromised, is there any other security protocol for Wi-Fi? make[3]: *** [regex.o] Fehler 1 make[3]: Leaving directory `/home/caspar/.paktahn/aur/gcc-gcj/src/gcc-4.8.1/build/libiberty' make[2]: *** [all-stage1-libiberty] Fehler 2 make[2]: Leaving directory `/home/caspar/.paktahn/aur/gcc-gcj/src/gcc-4.8.1/build' make[1]: *** [stage1-bubble] Fehler 2 make[1]: Leaving directory `/home/caspar/.paktahn/aur/gcc-gcj/src/gcc-4.8.1/build' make: *** [all] Fehler

This would mean the cc1plus is unable to do its job. http://raspberrypi.stackexchange.com/questions/15882/unable-to-compile-chromium Invocation command line was CONFIG_FILES = CONFIG_HEADERS = CONFIG_LINKS = CONFIG_COMMANDS = $ ./config.status on neonjohn config.status:997: creating Makefile ## ---------------- ## ## Cache variables. ## ## ---------------- ## ac_cv_build=arm-angstrom-linux-gnueabi ac_cv_c_compiler_gnu=yes How Long Does Fact Take To Become Legend (Medieval Setting) Which theme is this and how to get it on Ubuntu 16.04? cp/cp-lang.o c-family/stub-objc.o cp/call.o cp/decl.o cp/expr.o cp/pt.o cp/typeck2.o cp/class.o cp/decl2.o cp/error.o cp/lex.o cp/parser.o cp/ptree.o cp/rtti.o cp/typeck.o cp/cvt.o cp/except.o cp/friend.o cp/init.o cp/method.o cp/search.o cp/semantics.o cp/tree.o cp/repo.o cp/dump.o cp/optimize.o cp/mangle.o cp/cp-objcp-common.o cp/name-lookup.o cp/cxx-pretty-print.o cp/cp-cilkplus.o

Visit the following links: Site Howto | Site FAQ | Sitemap | Register Now If you have any problems with the registration process or your account login, please contact us. this contact form Maybe its because of my version of gcc : Code: $gcc -v gcc-Version 4.9.2 20150204 (prerelease) (GCC) Here the error messages from make: Code: checking whether the C compiler works... I followed all the steps in the link below. Toroso View Public Profile View LQ Blog View Review Entries View HCL Entries Find More Posts by Toroso Thread Tools Show Printable Version Email this Page Search this Thread Advanced

Error 1 means operation not permitted. Is for the Gcc version? de Sousa, PhD > Office: +351 213 100 213 > R. http://theresab.com/fatal-error/fatal-error-demigod-version-main.html The config.log from gcc-build directory only states that isl can't be found and won't be enabled.

Linked 13 How do I install Chrome OS? COLLECT_GCC=gcc COLLECT_LTO_WRAPPER=/usr/lib/gcc/i686-linux-gnu/4.6/lto-wrapper Target:i686-linux-gnu Configuredwith:../src/configure-v--with-pkgversion='Ubuntu/Linaro4.6.3-1ubuntu5'--with-bugurl=file:///usr/share/doc/gcc-4.6/README.Bugs--enable-languages=c,c++,fortran,objc,obj-c++--prefix=/usr--program-suffix=-4.6--enable-shared--enable-linker-build-id--with-system-zlib--libexecdir=/usr/lib--without-included-gettext--enable-threads=posix--with-gxx-include-dir=/usr/include/c++/4.6--libdir=/usr/lib--enable-nls--with-sysroot=/--enable-clocale=gnu--enable-libstdcxx-debug--enable-libstdcxx-time=yes--enable-gnu-unique-object--enable-plugin--enable-objc-gc--enable-targets=all--disable-werror--with-arch-32=i686--with-tune=generic--enable-checking=release--build=i686-linux-gnu--host=i686-linux-gnu--target=i686-linux-gnu Threadmodel:posix gccversion4.6.3(Ubuntu/Linaro4.6.3-1ubuntu5) configure:4212:$?=0 configure:4201:gcc-V>&5 gcc:error:unrecognizedoption'-V' gcc:fatalerror:noinputfiles compilationterminated. You could do the same. –Amumu Nov 15 '13 at 6:37 No comment by @honk is visible.

The following example is from gcc.

What mount point are you using exactly. Invocation command line was $ ./configure --build=arm-angstrom-linux-gnueabi --host=arm-angstrom-linux-gnueabi --prefix=/usr/arm-linux-gnueabi-4.8 -bindir=/usr/local/bin --disable-fortran --disable-java --disable-lto --disable-objc -enable-neon ## --------- ## ## Platform. ## ## --------- ## hostname = neonjohn uname -m = i686 How to start building a regression model when the most strongly associated predictor is binary Display a chain of little mountains with an odd number on the top of it! Contact Us - Advertising Info - Rules - LQ Merchandise - Donations - Contributing Member - LQ Sitemap - Main Menu Linux Forum Android Forum Chrome OS Forum Search LQ

Can anybody point me in the right direction? I also found the PKGBUILDs repo also has a customized build file in the extra/chromium directory which is supposed to work for arm6, but I'm also having trouble getting this to I am no C expert, but it seems that autoconf is not generating needed config.h files. Check This Out Last edited by Estorias; 02-25-2015 at 06:14 PM.

LFS is a project that provides you with the steps necessary to build your own custom Linux system. Is really $LFS set to /home/lfs/lfs ? I understand now I can ignore the 'isl' errors in the config.log. Find More Posts by ReaperX7 View Blog 02-25-2015, 02:59 PM #9 Estorias LQ Newbie Registered: Feb 2015 Posts: 6 Original Poster Rep: Quote: Originally Posted by ReaperX7 Question, but

configure:8647: $? = 1 configure:8636: /home/lfs/lfs/sources/gcc-build/./prev-gcc/xgcc -B/home/lfs/lfs/sources/gcc-build/./prev-gcc/ -B/tools/x86_64-unknown-linux-gnu/bin/ -B/tools/x86_64-unknown-linux-gnu/bin/ -B/tools/x86_64-unknown-linux-gnu/lib/ -isystem /tools/x86_64-unknown-linux-gnu/include -isystem /tools/x86_64-unknown-linux-gnu/sys-include -qversion >&5 xgcc: error: unrecognized command line option '-qversion' xgcc: fatal error: no input files /bin/ld: this I fixed this now. Arch + dwm • Mercurial repos • GithubRegistered Linux User #482438 Offline #5 2013-07-29 07:52:42 phillme Member Registered: 2013-07-26 Posts: 10 Re: [SOLVED] fatal error: config.h: No such file or directory although I ran into another error later that I had to disable multilib (--disable-multilib).

In it, you'll get: The week's top questions and answers Important community announcements Questions that need answers see an example newsletter By subscribing, you agree to the privacy policy and terms configure:4785:$?=4 configure:4789:checkingwhetherweareusingtheGNUC++compiler configure:4808:g++-cconftest.cpp>&5 configure:4808:$?=0 configure:4817:result:yes configure:4826:checkingwhetherg++accepts-g configure:4846:g++-c-gconftest.cpp>&5 configure:4846:$?=0 configure:4887:result:yes configure:4936:checkingwhetherg++accepts-static-libstdc++-static-libgcc configure:4953:g++-oconftest-g-O2-static-libstdc++-static-libgccconftest.cpp>&5 configure:4953:$?=0 configure:4954:result:yes configure:5018:checkingforgnatbind configure:5048:result:no configure:5110:checkingforgnatmake configure:5140:result:no configure:5159:checkingwhethercompilerdriverunderstandsAda configure:5182:result:no configure:5191:checkinghowtocomparebootstrappedobjects configure:5216:result:cmp--ignore-initial=16$$f1$$f2 configure:5270:checkingforobjdir configure:5285:result:.libs configure:5857:checkingforversion0.10ofISL configure:5876:gcc-oconftest-I$$r/$(HOST_SUBDIR)/gmp-I$$s/gmp-I/LFS/sources/gcc-build/../gcc/mpfr/src-I$$s/mpc/srcconftest.c-lisl>&5 conftest.c:10:25:fatalerror:isl/version.h:Nosuchfileordirectory compilationterminated. Because WPA 2 is compromised, is there any other security protocol for Wi-Fi? What's the last test output in config.log? –Benjamin Bannier Jun 18 '13 at 12:34 What exactly are you trying to compile? –Ramhound Jun 18 '13 at 12:42

I am pretty sure Ubuntu 14.10 won't be out until October. Shortest code to throw SIGILL How do we prove that something is unprovable?